{"text_format":"1","workbook":"xlsx","n_sheets":9,"sheets":["Instruktioner","1.GrundInfo","2.Betalningstjänster","3.RäntorOchKrediter","4.Specifika krav kravkatalog","5.Sammanställning","Blad1","Takpriser","Admin"],"not_rendered":{"charts":0,"images":2,"macros":1,"external_links":0,"defined_names":5,"comments":0,"pivot_tables":0},"unopened":[],"bounds":{"document_bytes":16777216,"sheet_cells":100000,"rows_first":2000,"rows_last":500,"rows_between":2000,"halvings":0,"cell_chars":16384,"cell_head_chars":4096},"cells_cut":0,"cells_raw":0,"read":"whole","date_system":"1900"}

{"sheet":"Instruktioner","index":0,"n_rows":72,"n_cols":12,"rows_kept":72,"cut":false,"hidden":false,"merged":[]}
[]
[]
[]
[null,null,null,null,null,null,null,null,null,null,null,"Beställaren fyller i gula fält."]
[null,null,null,null,null,null,null,null,null,null,null,"Leverantören fyller \ni gröna."]
["Avrop av Betalningstjänster med förnyad konkurrensutsättning "]
["Steg för steg hur mallen kan användas:"]
[]
["Observera när ni fyller i ett värde i de gula fälten så öppnas det upp en svarsflik."]
[]
["Steg 1 - Flik 1 Grundinfo "]
["Fyll i kontaktuppgifter och förutsättningar för den förnyade konkurrensutsättningen."]
[]
["Steg 2 - Flik 2 Betalningsförmedlingstjänster"]
["Fyll i uppskattade volymer för de tjänster ni önskar avropa. Ni fyller i volymer gällande antal konton och transaktioner. Leverantörer svarar med pris per enhet. "]
["Totalsumman efter summering visar på uppskattad kostnad för ett år."]
["Steg 3 - Flik 3 Räntor och krediter "]
["Ange uppgifter rörande checkräkningskrediter, koncernkonto, placeringskonton och valutakonton. "]
[" Det är viktigt att ni anger valuta och räntedatum i fält B4. "]
[]
{"$rows_left_out":53}
{"sheet":"1.GrundInfo","index":1,"n_rows":41,"n_cols":9,"rows_kept":41,"cut":false,"hidden":false,"merged":[[30,1,30,2],[30,3,30,5],[33,1,33,2],[33,3,33,5],[34,1,34,2],[34,3,34,5],[31,1,31,2],[31,3,31,5],[8,3,8,5],[9,3,9,5],[9,1,9,2],[2,9,2,11],[5,9,5,11],[6,9,6,11],[7,9,7,11],[8,9,8,11],[2,7,2,8],[6,1,6,2],[7,1,7,2],[8,1,8,2],[24,1,24,2],[24,3,24,5],[9,9,9,11],[4,1,4,2],[4,3,4,5],[4,7,4,8],[4,9,4,11],[5,7,5,8],[6,7,6,8],[7,7,7,8],[8,7,8,8],[9,7,9,8],[5,1,5,2],[5,3,5,5],[6,3,6,5],[7,3,7,5],[15,9,15,11],[16,9,16,11],[17,9,17,11],[15,1,15,2],[16,1,16,2],[17,1,17,2],[15,3,15,5],[16,3,16,5],[17,3,17,5],[16,7,16,8],[17,7,17,8],[15,7,15,8],[25,1,25,2],[25,3,25,5],[27,1,27,2],[27,3,27,5],[28,1,28,2],[28,3,28,5],[40,1,40,2],[40,3,40,5],[36,1,36,2],[36,3,36,5],[37,1,37,2],[37,3,37,5],[39,1,39,2],[39,3,39,5]]}
[null,"Avropsförfrågan på ramavtal Banktjänster 2023 Betalningstjänster inkl. infrastruktur "]
[]
[null,"1 - Kontaktuppgifter",null,null,null,null,null,null,"Diarienummer eller motsvarande"]
[]
[null,"Avropande myndighet",null,null,null,null,null,"Leverantör"]
[null,"Org-nr",null,null,null,null,null,"Org-nr"]
[null,"Kontaktperson",null,null,null,null,null,"Kontaktperson"]
[null,"Telefon",null,null,null,null,null,"Telefon"]
[null,"E-post",null,null,null,null,null,"E-post"]
[null,"Adress",null,null,null,null,null,"Adress"]
[]
[]
[]
[null,"2 - Förutsättningar"]
[]
[null,"Sista dag för avropssvar",null,null,null,null,null,"Avtalstid från"]
[null,"Sista dag för frågor och svar",null,null,null,null,null,"Kontraktets löptid"]
[null,"Anbudets giltighetstid",null,null,null,null,null,"Möjlig förlängning till"]
[]
[]
{"$rows_left_out":22}
{"sheet":"2.Betalningstjänster","index":2,"n_rows":103,"n_cols":7,"rows_kept":103,"cut":false,"hidden":false,"merged":[[205,1,205,4],[143,1,143,4],[166,1,166,4],[167,1,167,4],[168,1,168,4],[169,1,169,4],[200,1,202,1],[260,1,260,4],[218,1,218,4],[223,1,223,4],[234,1,235,1],[236,1,237,1],[245,1,245,4],[253,1,253,4],[6,2,6,3],[12,2,12,3],[17,2,17,3],[22,2,22,3],[31,2,31,3],[88,2,88,3],[93,2,93,3],[98,2,98,3],[41,2,41,3],[60,2,60,3],[64,2,64,3],[71,2,71,3],[85,2,85,3],[53,2,53,3],[42,2,42,3],[77,2,77,3]]}
[]
[]
[]
[]
[null,"Betalningstjänster inkl. infrastruktur"]
[]
[null,"1. Koncernkonto - infrastruktur","Uppskattad Volym vid anbudsutvärdering - per år",null,"Ange priser exklusive moms pris per enhet","Anbudsgivarens ev. kommentar/beskrivning","Totalsumma som kommer att användas vid anbudsutvärderingen"]
[null,"Pris per år för koncernkontostruktur","Antal konton",null,null,null,{"$f":"IFERROR(D8*E8,\"\")","v":0}]
[null,"Pris per år för valutor i koncernkontostrukturen. Pris per valuta","Antal valutor",null,null,null,{"$f":"IFERROR(D9*E9,\"\")","v":0}]
[null,"Pris per år för transaktionskonton i koncernkontostrukturen (underkonton)","Antal konton",null,null,null,{"$f":"IFERROR(D10*E10,\"\")","v":0}]
[null,"Pris per år för summeringskonto/samlingskonton i koncernkontostrukturen","Antal konton",null,null,null,0]
[]
[null,"2. Övriga bankkonton","Uppskattad Volym vid anbudsutvärdering - per år",null,"Ange priser exklusive moms pris per enhet","Anbudsgivarens ev. kommentar/beskrivning","Totalsumma som kommer att användas vid anbudsutvärderingen"]
[null,"Pris per år för fristående företagskonto","Antal konton",null,null,null,{"$f":"IFERROR(D14*E14,\"\")","v":0}]
[null,"Pris per år för fristående valutakonto","Antal konton",null,null,null,0]
[null,"Pris per år för placeringskonto","Antal konton",null,null,null,0]
[]
[null,"3. Internetbank","Uppskattad Volym vid anbudsutvärdering - per år",null,"Ange priser exklusive moms pris per enhet","Anbudsgivarens ev. kommentar/beskrivning","Totalsumma som kommer att användas vid anbudsutvärderingen"]
[null,"Pris per år för internetbankstjänst. Ange ert pris som årligt pris per koncernkontostruktur.","Antal",null,null,null,{"$f":"IFERROR(D19*E19,\"\")","v":0}]
[null,"Pris per år för internetbankstjänst. Ange ert pris som årligt pris för de organisationsnummer som ligger utanför UMs koncernkontostruktur.","Antal",null,null,null,0]
{"$rows_left_out":84}
{"sheet":"3.RäntorOchKrediter","index":3,"n_rows":38,"n_cols":15,"rows_kept":38,"cut":false,"hidden":false,"merged":[[1,0,1,2],[4,1,4,2]]}
[]
["Räntor och krediter"]
[null,"Datum","Klockslag"]
["Avläsning ränta och valuta"]
["Ange maxbelopp för checkräkningskredit"]
["Instruktion: Anbudsgivaren ska lämna svar i tabellen i de rutor som är grönmarkerade. (Grå rutor är låsta och kan ej fyllas i)","CHECKRÄKNING (negativt saldo)","TILLGODOHAVANDE  KONCERNKONTO (positivt saldo)","TILLGODOHAVANDE     KONTO Placeringskonto/fondkonto",null,"TILLGODOHAVANDE \nVALUTAKONTO\n(vanliga valutor)","TILLGODOHAVANDE \nVALUTAKONTO\n(vanliga valutor)","TILLGODOHAVANDE \nVALUTAKONTO\n(vanliga valutor)","TILLGODOHAVANDE \nVALUTAKONTO\n(vanliga valutor)","TILLGODOHAVANDE \nVALUTAKONTO\n(övriga valutor)","TILLGODOHAVANDE \nVALUTAKONTO\n(övriga valutor)","TILLGODOHAVANDE \nVALUTAKONTO\n(övriga valutor)","TILLGODOHAVANDE \nVALUTAKONTO\n(övriga valutor)","TILLGODOHAVANDE \nVALUTAKONTO\n(övriga valutor)","TILLGODOHAVANDE \nVALUTAKONTO\n(övriga valutor)"]
[null,"SEK","SEK","SEK",null,"USD","EUR","GBP","DKK"]
["Snittsaldo - genomsnittlig summa på kontot under ett år"]
["Antal dagar per år ( negativt resp. positivt saldo)",null,null,null,null,null,null,null,null,365,365,365,365,365,365]
["Räntekapitalisering ","Kvartalsvis ","Årsvis","Årsvis",null,"Årsvis","Årsvis","Årsvis","Årsvis","Årsvis","Årsvis","Årsvis","Årsvis","Årsvis","Årsvis"]
["Ange dagräkningskonvention ","Act/360","Act/360","Act/360",null,"Act/360","Act/360","Act/365","Act/360","Act/360","Act/360","Act/360","Act/360","Act/360","Act/360"]
["Ränta på räntebasen den valda dagen"]
["Ange tillkommande/avgående marginal (%)"]
[" Ränta inkl marginal (%)",{"$f":"B13+B12","v":0},{"$f":"C12-C13","v":0},0,0,0,0,0,0,0,0,0,0,0,0]
["Årsränta inkl marginal (%)",{"$f":"IFERROR((((1+(B14/100)*(VLOOKUP(B10,Admin!$AM$15:$AN$19,2,0)/365))^(365/VLOOKUP(B10,Admin!$AM$15:$AN$19,2,0)))-1)*(365/365*100),\"\")","v":0},{"$f":"IFERROR((((1+(C14/100)*(VLOOKUP(C10,Admin!$AM$15:$AN$19,2,0)/365))^(365/VLOOKUP(C10,Admin!$AM$15:$AN$19,2,0)))-1)*(365/365*100),\"\")","v":0},{"$f":"IFERROR((((1+(D14/100)*(VLOOKUP(D10,Admin!$AM$15:$AN$19,2,0)/365))^(365/VLOOKUP(D10,Admin!$AM$15:$AN$19,2,0)))-1)*(365/365*100),\"\")","v":0},{"$f":"IFERROR((((1+(E14/100)*(VLOOKUP(E10,Admin!$AM$15:$AN$19,2,0)/365))^(365/VLOOKUP(E10,Admin!$AM$15:$AN$19,2,0)))-1)*(365/365*100),\"\")","v":""},{"$f":"IFERROR((((1+(F14/100)*(VLOOKUP(F10,Admin!$AM$15:$AN$19,2,0)/365))^(365/VLOOKUP(F10,Admin!$AM$15:$AN$19,2,0)))-1)*(365/365*100),\"\")","v":0},{"$f":"IFERROR((((1+(G14/100)*(VLOOKUP(G10,Admin!$AM$15:$AN$19,2,0)/365))^(365/VLOOKUP(G10,Admin!$AM$15:$AN$19,2,0)))-1)*(365/365*100),\"\")","v":0},{"$f":"IFERROR((((1+(H14/100)*(VLOOKUP(H10,Admin!$AM$15:$AN$19,2,0)/365))^(365/VLOOKUP(H10,Admin!$AM$15:$AN$19,2,0)))-1)*(365/365*100),\"\")","v":0},{"$f":"IFERROR((((1+(I14/100)*(VLOOKUP(I10,Admin!$AM$15:$AN$19,2,0)/365))^(365/VLOOKUP(I10,Admin!$AM$15:$AN$19,2,0)))-1)*(365/365*100),\"\")","v":0},{"$f":"IFERROR((((1+(J14/100)*(VLOOKUP(J10,Admin!$AM$15:$AN$19,2,0)/365))^(365/VLOOKUP(J10,Admin!$AM$15:$AN$19,2,0)))-1)*(365/365*100),\"\")","v":0},{"$f":"IFERROR((((1+(K14/100)*(VLOOKUP(K10,Admin!$AM$15:$AN$19,2,0)/365))^(365/VLOOKUP(K10,Admin!$AM$15:$AN$19,2,0)))-1)*(365/365*100),\"\")","v":0},{"$f":"IFERROR((((1+(L14/100)*(VLOOKUP(L10,Admin!$AM$15:$AN$19,2,0)/365))^(365/VLOOKUP(L10,Admin!$AM$15:$AN$19,2,0)))-1)*(365/365*100),\"\")","v":0},{"$f":"IFERROR((((1+(M14/100)*(VLOOKUP(M10,Admin!$AM$15:$AN$19,2,0)/365))^(365/VLOOKUP(M10,Admin!$AM$15:$AN$19,2,0)))-1)*(365/365*100),\"\")","v":0},{"$f":"IFERROR((((1+(N14/100)*(VLOOKUP(N10,Admin!$AM$15:$AN$19,2,0)/365))^(365/VLOOKUP(N10,Admin!$AM$15:$AN$19,2,0)))-1)*(365/365*100),\"\")","v":0},{"$f":"IFERROR((((1+(O14/100)*(VLOOKUP(O10,Admin!$AM$15:$AN$19,2,0)/365))^(365/VLOOKUP(O10,Admin!$AM$15:$AN$19,2,0)))-1)*(365/365*100),\"\")","v":0}]
["Namn på räntebas"]
[]
["Eventuell årlig kreditavgift (% på kreditram)"]
["Kreditavgift kronor",{"$f":"-ABS(B5*B18%)","v":0}]
["Bedömda valutakurser"]
{"$rows_left_out":19}
{"sheet":"4.Specifika krav kravkatalog","index":4,"n_rows":49,"n_cols":43,"rows_kept":49,"cut":false,"hidden":false,"merged":[[41,4,41,5],[42,4,42,5],[43,4,43,5],[44,4,44,5],[45,4,45,5],[46,4,46,5],[47,4,47,5],[48,4,48,5],[17,2,17,5],[18,2,18,5],[16,2,16,5],[15,2,15,5],[11,12,11,13],[12,12,12,13],[13,12,13,13],[14,12,14,13],[39,4,39,5],[40,4,40,5],[16,7,16,8],[17,7,17,8],[18,7,18,8],[16,9,16,10],[17,9,17,10],[39,7,39,8],[40,7,40,8],[1,7,1,8],[4,18,4,19],[5,18,5,19],[6,18,6,19],[7,18,7,19],[8,18,8,19],[9,18,9,19],[10,18,10,19],[39,13,39,14],[17,18,17,19],[18,18,18,19],[15,7,15,8],[15,9,15,10],[9,12,9,13],[9,14,9,16],[10,12,10,13],[10,14,10,16],[11,14,11,16],[12,14,12,16],[13,14,13,16],[14,14,14,16],[15,12,15,13],[15,14,15,16],[11,18,11,19],[7,20,7,21],[8,20,8,21],[9,20,9,21],[10,20,10,21],[6,20,6,21],[5,20,5,21],[4,20,4,21],[4,2,4,5],[4,7,4,8],[4,12,4,13],[4,14,4,16],[5,2,5,5],[5,7,5,8],[5,12,5,13],[5,14,5,16],[6,2,6,5],[6,7,6,8],[6,12,6,13],[6,14,6,16],[8,2,8,5],[9,2,9,5],[10,2,10,5],[8,12,8,13],[8,14,8,16],[12,18,12,19],[13,18,13,19],[14,18,14,19],[7,2,7,5],[7,7,7,8],[7,12,7,13],[7,14,7,16],[8,7,8,8],[9,7,9,8],[10,7,10,8],[11,2,11,5],[12,2,12,5],[13,2,13,5],[14,2,14,5],[11,7,11,8],[12,7,12,8],[13,7,13,8],[14,7,14,8],[12,20,12,21],[46,9,46,10],[47,9,47,10],[48,9,48,10],[41,13,41,14],[42,13,42,14],[43,13,43,14],[44,13,44,14],[45,13,45,14],[46,13,46,14],[47,13,47,14],[48,13,48,14],[41,9,41,10],[13,20,13,21],[14,20,14,21],[18,20,18,21],[17,12,17,13],[17,14,17,16],[16,12,16,13],[16,14,16,16],[18,12,18,13],[18,14,18,16],[15,18,15,19],[16,18,16,19],[48,7,48,8],[18,9,18,10],[1,20,1,21],[42,9,42,10],[43,9,43,10],[44,9,44,10],[45,9,45,10],[4,9,4,10],[5,9,5,10],[6,9,6,10],[7,9,7,10],[8,9,8,10],[9,9,9,10],[10,9,10,10],[11,9,11,10],[12,9,12,10],[13,9,13,10],[14,9,14,10],[39,9,39,10],[40,9,40,10],[16,20,16,21],[17,20,17,21],[15,20,15,21],[11,20,11,21],[41,7,41,8],[42,7,42,8],[43,7,43,8],[44,7,44,8],[45,7,45,8],[46,7,46,8],[47,7,47,8],[39,16,39,19],[41,16,41,19],[40,16,40,19],[40,13,40,14],[48,16,48,19],[47,16,47,19],[46,16,46,19],[45,16,45,19],[44,16,44,19],[43,16,43,19],[42,16,42,19],[39,20,39,21],[48,20,48,21],[47,20,47,21],[46,20,46,21],[45,20,45,21],[44,20,44,21],[43,20,43,21],[42,20,42,21],[41,20,41,21],[40,20,40,21]]}
[]
[null,"Krav enligt kravkatalog",null,null,null,null,null,"Högsta möjliga pris-avdrag","Möjliga abdrag",null,null,null,null,null,null,null,null,null,null,null,"Förändringar i Utvärderingskostnader",null,null,null,null,{"$f":"IFERROR(SUM(Z5:Z49),\"\")","v":0},{"$f":"IFERROR(SUM(AA5:AA49),\"\")","v":0}]
[]
[]
[null,"Krav-katalogstyp","Krav / Utförande",null,null,null,"Krav- typ*","Beskrivning av utvärdering",null,"Mervärdesavdrag",null,"Kravet Uppfylls*","Verifikat",null,"Kommentar Leverantör",null,null,"Beställar Kontroll*","Erhållet Mervärdesavdrag",null,"Krav-kommentar",null,null,null,null,"Kostnadsökning","Kostnadsavdrag"]
[null,null,null,null,null,null,null,null,null,null,null,null,null,null,null,null,null,null,null,null,null,null,null,{"$f":"IF(AND(G6=\"Bör\",L6=\"Ja\",R6<>\"Uppfylls Ej\"),IF(R6=\"Kravet Uppfylls\",ABS(J6),IF(ABS(S6)>0,ABS(S6),\"\")),\"\")","v":""},null,{"$f":"IF(IF(X6=\"\",\"\",MIN(X6,0))=0,\"\",IF(X6=\"\",\"\",MIN(X6,0)))","v":""},{"$f":"IF(IF(X6=\"\",\"\",MAX(X6,0))=0,\"\",IF(X6=\"\",\"\",MAX(X6,0)))","v":""},null,null,null,null,null,null,null,null,null,null,null,null,null,null,null,""]
[null,null,null,null,null,null,null,null,null,null,null,null,null,null,null,null,null,null,null,null,null,null,null,{"$f":"IF(AND(G7=\"Bör\",L7=\"Ja\",R7<>\"Uppfylls Ej\"),IF(R7=\"Kravet Uppfylls\",ABS(J7),IF(ABS(S7)>0,ABS(S7),\"\")),\"\")","v":""},null,{"$f":"IF(IF(X7=\"\",\"\",MIN(X7,0))=0,\"\",IF(X7=\"\",\"\",MIN(X7,0)))","v":""},{"$f":"IF(IF(X7=\"\",\"\",MAX(X7,0))=0,\"\",IF(X7=\"\",\"\",MAX(X7,0)))","v":""}]
[null,null,null,null,null,null,null,null,null,null,null,null,null,null,null,null,null,null,null,null,null,null,null,{"$f":"IF(AND(G8=\"Bör\",L8=\"Ja\",R8<>\"Uppfylls Ej\"),IF(R8=\"Kravet Uppfylls\",ABS(J8),IF(ABS(S8)>0,ABS(S8),\"\")),\"\")","v":""},null,"",""]
[null,null,null,null,null,null,null,null,null,null,null,null,null,null,null,null,null,null,null,null,null,null,null,"",null,"",""]
[null,null,null,null,null,null,null,null,null,null,null,null,null,null,null,null,null,null,null,null,null,null,null,"",null,"",""]
[null,null,null,null,null,null,null,null,null,null,null,null,null,null,null,null,null,null,null,null,null,null,null,"",null,"",""]
[null,null,null,null,null,null,null,null,null,null,null,null,null,null,null,null,null,null,null,null,null,null,null,"",null,"",""]
[null,null,null,null,null,null,null,null,null,null,null,null,null,null,null,null,null,null,null,null,null,null,null,"",null,"",""]
[null,null,null,null,null,null,null,null,null,null,null,null,null,null,null,null,null,null,null,null,null,null,null,"",null,"",""]
[null,null,null,null,null,null,null,null,null,null,null,null,null,null,null,null,null,null,null,null,null,null,null,"",null,"",""]
[null,null,null,null,null,null,"Ska",null,null,null,null,null,null,null,null,null,null,null,null,null,null,null,null,"",null,"",""]
[null,null,null,null,null,null,"Bör",null,null,null,null,null,null,null,null,null,null,null,null,null,"",null,null,"",null,"",""]
[null,null,null,null,null,null,"Ska",null,null,null,null,null,null,null,null,null,null,null,null,null,"",null,null,"",null,"",""]
[null,null,null,null,null,null,"Ska",null,null,null,null,null,null,null,null,null,null,null,null,null,"",null,null,"",null,"",""]
[null,null,null,null,null,null,null,null,null,null,null,null,null,null,null,null,null,null,null,null,{"$f":"IF(AND(G20=\"Bör\",J20=\"Ja\",P20<>\"Uppfylls Ej\"),IF(Q20=\"\",#REF!,Q20),\"\")","v":""}]
{"$rows_left_out":30}
{"sheet":"5.Sammanställning","index":5,"n_rows":13,"n_cols":9,"rows_kept":13,"cut":false,"hidden":false,"merged":[[12,3,12,5],[10,3,10,5],[3,2,3,5],[6,3,6,5],[4,3,4,5],[5,3,5,5],[4,2,6,2],[8,3,8,5]]}
[]
[]
[]
[null,null,null,null,null,null,"Årliga kostnader","Avdrag och intäkter"]
[null,null,"Anbudspris","Betalningstjänster inkl. infrastruktur",null,null,{"$f":"IFERROR('2.Betalningstjänster'!G103,\"Fel. Kontrollera motsvarande flik\")","v":0}]
[null,null,null,"Räntor och krediter",null,null,{"$f":"'3.RäntorOchKrediter'!A30","v":0},{"$f":"'3.RäntorOchKrediter'!A33","v":0},{"$f":"IF('3.RäntorOchKrediter'!A22<>\"\", '3.RäntorOchKrediter'!A22 & \" för valutakonton på flik 2\",\"\")","v":""}]
[null,null,null,"Totalt",null,null,{"$f":"SUM(G5:G6)","v":0},{"$f":"SUM(H5:H6)","v":0}]
[]
[null,null,null,"Påslag/avdrag utvärdering",null,null,{"$f":"'4.Specifika krav kravkatalog'!Z2","v":0},{"$f":"'4.Specifika krav kravkatalog'!AA2","v":0}]
[]
[null,null,null,"Utvärderingssumma, kostnad per år",null,null,{"$f":"G7+G9","v":0},{"$f":"H7+H9","v":0}]
[]
[null,null,null,"Total utvärderingskostnad",null,null,{"$f":"G11-H11","v":0}]

{"sheet":"Blad1","index":6,"n_rows":15,"n_cols":1,"rows_kept":15,"cut":false,"hidden":true,"merged":[]}
[]
[]
[]
[]
["Service och tillgängligher"]
["Koncernkonto, funktionalitet och räntevillkor"]
["Valutering"]
["Betalningsförmedling"]
["Utbetalning av försörjningsstöd och övriga utbetalningar"]
[" Internetbank - behörighetsadministration"]
[" Lönespecifikation"]
["Korttjänster"]
["Pappersformat"]
["Finansiella tjänster"]
["Resekonto"]

{"sheet":"Takpriser","index":7,"n_rows":95,"n_cols":5,"rows_kept":95,"cut":false,"hidden":true,"merged":[]}
[]
[]
[]
[null,null,"Kommentar","Swedbank","Nordea"]
[null,"Pris per år för koncernkontostruktur. ",null,30000,10000]
[null,"Pris per år för transaktionskonton i koncernkontostrukturen.",null,300,1500]
[null,"Pris per år för summeringskonto/samlingskonton i koncernkontostrukturen.",null,300,1500]
[null,"Pris per år för (transaktion)konton utanför koncernkontostrukturen.",null,300,750]
[null,null,null,""]
[null,"2. Övriga bankkonton",null,"Pris, exklusive moms","Pris, exklusive moms"]
[null,"Pris per år för fristående valutakonto",null,300,450]
[null,"Pris per år för valutakonto i koncernstruktur",null,10000,1500]
[null,"Pris per år för placeringskonto",null,300,0]
[null,"Pris per år för fondkonto",null,300,0]
[null,"Pris per år för bankgirokonto",null,250,0]
[null,null,null,""]
[null,"3. Internetbank",null,"Pris, exklusive moms","Pris, exklusive moms"]
[null,"Pris per år för internetbankstjänst. Ange ert pris som årligt pris per koncernkontostruktur.",null,5000,2000]
[null,"Pris per år för internetbankstjänst. Ange ert pris som årligt pris för de organisationsnummer som ligger utanför UMs koncernkontostruktur.",null,0,2000]
[null,"Pris per säkerhetsdosa eller liknande lösning",null,0,0]
{"$rows_left_out":76}
{"sheet":"Admin","index":8,"n_rows":256,"n_cols":49,"rows_kept":256,"cut":false,"hidden":true,"merged":[]}
[]
[null,null,null,null,null,null,null,"Kravlistor",null,null,"Val"]
[null,"Faktor","Nordea","Swedbank",null,"Kategorier",null,"Kategori","Krav",null,"BörSka",null,null,null,"Utvärdering",null,null,null,null,null,null,null,null,null,null,null,null,null,"Utvärdering",null,"Valutor",null,"Bank","Nordea","Swedbank",null,null,null,"Data för beräkningar",null,null,"Land","Valuta",null,"Vanliga",null,"Räntebaser","Standardavvikelse","Innehåller negativa räntor"]
[null,"Pris per år för bankgirokonto",1,2,null,"1.1 Service/tillgänglighet ",null,"1.1 Service/tillgänglighet ","Tillgänglighet samt support efter kontorstid  ",null,"Bör",null,null,null,"Ja","Ja","Ja","Ja","Ja","Ja","Ja","Ja","Ja","Ja","Ja","Nej",null,null,"Beställar kontroll",null,"EUR",null,"Org-nr","9999-9999","8888-8888",null,null,null,null,null,null,"Afghan afghani","AFN",null,"EUR",null,"Stibor",0.14544965005583199]
[null,null,null,null,null,"1.2 Räntevillkor ",null,"1.1 Service/tillgänglighet ","Servicenivå för betalningsförmedling ",null,"Ska",null,null,null,"Nej",10,9,8,7,6,5,4,3,2,1,0,null,null,"Kravet Uppfylls",null,"DKK",null,"Kontaktperson","Anders Bankmansson","Johan Bankmansson",null,null,null,null,null,null,"European euro","EUR",null,"DKK",null,"VECU",0.19999990000000001]
[null,null,null,null,null,"1.3 Valuteringskrav ",null,"1.1 Service/tillgänglighet ","Servicenivå för löneförmedling ",null,null,null,null,null,0,9,8,7,6,5,4,3,2,1,0,null,null,null,"Uppfylls Delvis",null,"GBP",null,"Telefon",999,888,null,null,null,null,null,null,"European euro","EUR",null,"GBP",null,"VECI",0.19999990000000001,"NEJ"]
[null,null,null,null,null,"1.4 Bidragsutbetalningar ",null,"1.1 Service/tillgänglighet ","Kundteam och specialistfunktioner.  ",null,null,null,null,null,1,8,7,6,5,4,3,2,1,0,"Nej",null,null,null,"Uppfylls Ej",null,"USD",null,"E-post","Bankmansson@nordea.qq","Bankmansson@swedbank.qq",null,null,null,null,null,null,"Albanian lek","ALL",null,"USD"]
[null,null,null,null,null,"1.5.1 Lönespecifikation i pappersformat ",null,"1.1 Service/tillgänglighet ","Möjligheter/initiativ för effektivisering av UMs funktioner/arbetssätt. ",null,null,null,null,null,2,7,6,5,4,3,2,1,0,"Nej",null,null,null,null,null,null,"SEK",null,"Adress","Bankvägen 1","Bankvägen 2",null,null,null,null,null,null,"Algerian dinar","DZD",null,"NOK"]
[null,null,null,null,null,"1.5.2 Kontrolluppgift i pappersformat",null,"1.1 Service/tillgänglighet ","Annat service/tillgänglighet ",null,null,null,null,null,3,6,5,4,3,2,1,0,"Nej",null,null,null,null,null,null,null,null,null,null,null,null,null,null,null,null,null,null,"United States dollar","USD"]
[null,null,null,null,null,"1.5.3 Kontoutdrag eller annan betalningsstatistik på papper",null,"1.2 Räntevillkor ","Ränteberäkningsvillkor",null,null,null,null,null,4,5,4,3,2,1,0,"Nej",null,null,null,null,null,null,null,null,null,null,null,null,null,null,null,null,null,null,null,"European euro","EUR"]
[null,null,null,null,null,"1.6 Finansiella tjänster",null,"1.2 Räntevillkor ","Räntebas  ",null,null,null,null,null,5,4,3,2,1,0,"Nej",null,null,null,null,null,null,null,null,null,null,null,null,null,null,null,null,null,null,null,null,"Angolan kwanza","AOA"]
[null,null,null,null,null,"1.7 Resekonto",null,"1.2 Räntevillkor ","Räntekonvention",null,null,null,null,null,6,3,2,1,0,"Nej",null,null,null,null,null,null,null,null,null,null,null,null,null,null,null,null,null,null,null,null,null,"East Caribbean dollar","XCD"]
[null,null,null,null,"1.8 Pris",null,null,"1.2 Räntevillkor ","Kreditavgift",null,null,null,null,null,7,2,1,0,"Nej",null,null,null,null,null,null,null,null,null,null,null,null,null,null,null,null,null,null,null,null,null,null,"East Caribbean dollar","XCD"]
[null,null,null,null,null,"2.1 Service/tillgänglighet",null,"1.2 Räntevillkor ","Inlåningsavgift ",null,null,null,null,null,8,1,0,"Nej",null,null,null,null,null,null,null,null,null,null,null,null,null,null,null,null,null,null,null,null,"Saknas data",null,null,"Argentine peso","ARS"]
[null,null,null,null,null,"2.2 Betalterminaler",null,"1.2 Räntevillkor ","Leverantören ska/bör ge möjlighet för UM att utöka kredit under avtalstiden.",null,null,null,null,null,9,0,"Nej",null,null,null,null,null,null,null,null,null,null,null,null,null,null,null,null,null,null,null,null,null,"Halvårsvis",182.5,null,"Armenian dram","AMD"]
[null,null,null,null,null,"2.3 Pris",null,"1.2 Räntevillkor ","Konton under ett visst toppkonto att ska/bör hämta samma räntevillkor som gäller för toppkontot. Detta innebär att vid en ränteändring på toppkonto uppdateras räntevillkor automatiskt på alla underliggande konton.",null,null,null,null,null,10,"Nej",null,null,null,null,null,null,null,null,null,null,null,null,null,null,null,null,null,null,null,null,null,null,"Kvartalsvis ",91.25,null,"Aruban florin","AWG"]
[null,null,null,null,null,null,null,"1.2 Räntevillkor ","Annat räntevillkor ",null,null,null,null,null,null,null,null,null,null,null,null,null,null,null,null,null,null,null,null,null,null,null,null,null,null,null,null,null,null,null,null,"Saint Helena pound","SHP"]
[null,null,null,null,null,null,null,"1.3 Valuteringskrav ","Tillämpa förmånsvalutering på alla bankgiroinbetalningar vilket innebär att ränta räknas på det insatta beloppet redan fr.o.m. bokföringsdagen. ",null,null,null,null,null,null,null,null,null,null,null,null,null,null,null,null,null,null,null,null,null,null,null,null,null,null,null,null,null,"Månadsvis",30.416666666666668,null,"Australian dollar","AUD"]
[null,null,null,null,null,null,null,"1.3 Valuteringskrav ","Erbjuda att bokföringsdag och valutadag är samma dag för ankommande betalningar. ",null,null,null,null,null,null,null,null,null,null,null,null,null,null,null,null,null,null,null,null,null,null,null,null,null,null,null,null,null,"Årsvis",365,null,"European euro","EUR"]
[null,null,null,null,null,null,null,"1.3 Valuteringskrav ","Valutera lönelikviden från UMs konto bankdagen före löneutbetalning. ",null,null,null,null,null,null,null,null,null,null,null,null,null,null,null,null,null,null,null,null,null,null,null,null,null,null,null,null,null,0,0,null,"Azerbaijan manat","AZN"]
{"$rows_left_out":236}